Target
Polymerase basic protein 2
Ligand
BDBM552336
Substrate
Meas. Tech.
Influenza Antiviral Assay
EC50
0.900±n/a nM
Citation
 Hendricks, RTStoycheva, ADBonfanti, JRaboisson, PJFortin, JMMercey, GJ Macrocyclic flu endonuclease inhibitors US Patent  US11312727 Publication Date 4/26/2022 
Target
Name:
Polymerase basic protein 2
Synonyms:
B4URF7_I33A0 RNA-directed RNA polymerase subunit P3
Type:
Protein
Mol. Mass.:
85824.43
Organism:
Influenza A virus (strain A/WS/1933 H1N1)
Description:
B4URF7
Residue:
759
  
Inhibitor
Name:
BDBM552336
Synonyms:
US11312727, Compound 108D
Type:
Small organic molecule
Emp. Form.:
C27H21F2N3O4S
Mol. Mass.:
521.535
SMILES:
Oc1c2C(=O)N3CN([C@@H]4c5ccccc5SCc5c(F)c(F)cc(OC\C=C/C33CC3)c45)n2ccc1=O
: