Target
Polymerase basic protein 2
Ligand
BDBM552351
Substrate
Meas. Tech.
Influenza Antiviral Assay
EC50
1.50±n/a nM
Citation
 Hendricks, RTStoycheva, ADBonfanti, JRaboisson, PJFortin, JMMercey, GJ Macrocyclic flu endonuclease inhibitors US Patent  US11312727 Publication Date 4/26/2022 
Target
Name:
Polymerase basic protein 2
Synonyms:
B4URF7_I33A0 RNA-directed RNA polymerase subunit P3
Type:
Protein
Mol. Mass.:
85824.43
Organism:
Influenza A virus (strain A/WS/1933 H1N1)
Description:
B4URF7
Residue:
759
  
Inhibitor
Name:
BDBM552351
Synonyms:
US11312727, Compound 141AA
Type:
Small organic molecule
Emp. Form.:
C25H22FN3O4
Mol. Mass.:
447.4583
SMILES:
C[C@@H]1\C=C\COc2c(F)cccc2[C@H](N2CN1C(=O)c1c(O)c(=O)ccn21)c1ccccc1
: