Target
Polymerase basic protein 2
Ligand
BDBM552390
Substrate
Meas. Tech.
Influenza Antiviral Assay
EC50
0.510±n/a nM
Citation
 Hendricks, RTStoycheva, ADBonfanti, JRaboisson, PJFortin, JMMercey, GJ Macrocyclic flu endonuclease inhibitors US Patent  US11312727 Publication Date 4/26/2022 
Target
Name:
Polymerase basic protein 2
Synonyms:
B4URF7_I33A0 RNA-directed RNA polymerase subunit P3
Type:
Protein
Mol. Mass.:
85824.43
Organism:
Influenza A virus (strain A/WS/1933 H1N1)
Description:
B4URF7
Residue:
759
  
Inhibitor
Name:
BDBM552390
Synonyms:
(17a′*S,*E)-12′-hydroxy-2′,17a′-dihydro-6′H-spiro[cyclopentane-1,9′-[3,4](epiprop[1]en[1]yl[3]ylidene)[10,17]methanobenzo[6,7]thiepino[4,5-c]pyrido[1,2-f][1]oxa[5,6,9]triazacyclotridecine]-11′,13′-dione | US11312727, Compound 156A
Type:
Small organic molecule
Emp. Form.:
C29H27N3O4S
Mol. Mass.:
513.607
SMILES:
Oc1c2C(=O)N3CN([C@@H]4c5ccccc5SCc5cccc(OC\C=C\C33CCCC3)c45)n2ccc1=O
: