Target
Lethal factor
Ligand
BDBM8521
Substrate
MAPKKide
Meas. Tech.
Fluorescence Resonance Energy Transfer Assay (FRET)
pH
7.4±n/a
Temperature
295.15±n/a K
Ki
10700±1900 nM
Citation
 Jiao, GSCregar, LGoldman, MEMillis, SZTang, C Guanidinylated 2,5-dideoxystreptamine derivatives as anthrax lethal factor inhibitors. Bioorg Med Chem Lett 16:1527-31 (2006)  
Target
Name:
Lethal factor
Synonyms:
Anthrax Lethal Factor (LF) Antrax lethal toxin lef | lethal factor
Type:
PROTEIN
Mol. Mass.:
93758.56
Organism:
Bacillus anthracis
Description:
ChEMBL_1460338
Residue:
809
  
Inhibitor
Name:
BDBM8521
Synonyms:
4-[(1S,2S,4S,5R)-2,4-bis(carbamimidamidomethyl)-5-hydroxycyclohexyl]naphthalene-1,3-diguanidine | Guanidinylated 2,5-dideoxystreptamine deriv. 8g
Type:
Small organic molecule
Emp. Form.:
C22H34N12O
Mol. Mass.:
482.5852
SMILES:
[#7]\[#6](-[#7])=[#7]\[#6]-[#6@@H]-1-[#6]-[#6@H](-[#6]\[#7]=[#6](/[#7])-[#7])-[#6@H](-[#6]-[#6@H]-1-[#8])-c1c(cc(\[#7]=[#6](/[#7])-[#7])c2ccccc12)\[#7]=[#6](\[#7])-[#7]
:
Substrate
Name:
MAPKKide
Synonyms:
Type:
Peptide
Mol. Mass.:
358.43
Organism:
Description:
MAPPKKide is a quenched fluoresent substrate peptide based on fluorescence resonance energy transfer (FRET). The o-aminobenzoic acid is on N terminus and 2, 4-dinitrophenol on C terminus (List Biological Laboratories, Inc, Campbell, CA).
Residue:
3
NA