Target
Lethal factor
Ligand
BDBM8523
Substrate
MAPKKide
Meas. Tech.
Fluorescence Resonance Energy Transfer Assay (FRET)
pH
7.4±n/a
Temperature
295.15±n/a K
Ki
24800±4500 nM
Citation
 Jiao, GSCregar, LGoldman, MEMillis, SZTang, C Guanidinylated 2,5-dideoxystreptamine derivatives as anthrax lethal factor inhibitors. Bioorg Med Chem Lett 16:1527-31 (2006)  
Target
Name:
Lethal factor
Synonyms:
Anthrax Lethal Factor (LF) Antrax lethal toxin lef | lethal factor
Type:
PROTEIN
Mol. Mass.:
93758.56
Organism:
Bacillus anthracis
Description:
ChEMBL_1460338
Residue:
809
  
Inhibitor
Name:
BDBM8523
Synonyms:
(1S,2R,4S,5R)-2,4-bis(carbamimidamidomethyl)-5-hydroxycyclohexyl N-(2-carbamimidamidophenyl)carbamate | Guanidinylated 2,5-dideoxystreptamine deriv. 10
Type:
Small organic molecule
Emp. Form.:
C18H30N10O3
Mol. Mass.:
434.496
SMILES:
[#7]\[#6](-[#7])=[#7]\[#6]-[#6@@H]-1-[#6]-[#6@H](-[#6]\[#7]=[#6](\[#7])-[#7])-[#6@H](-[#6]-[#6@H]-1-[#8])-[#8]-[#6](=O)-[#7]-c1ccccc1\[#7]=[#6](/[#7])-[#7]
:
Substrate
Name:
MAPKKide
Synonyms:
Type:
Peptide
Mol. Mass.:
358.43
Organism:
Description:
MAPPKKide is a quenched fluoresent substrate peptide based on fluorescence resonance energy transfer (FRET). The o-aminobenzoic acid is on N terminus and 2, 4-dinitrophenol on C terminus (List Biological Laboratories, Inc, Campbell, CA).
Residue:
3
NA