Target
5-hydroxytryptamine receptor 2A
Ligand
BDBM555031
Substrate
Meas. Tech.
Binding Activity Assay
Ki
0.200±n/a nM
Citation
 Fujii, YSakuma, MAihara, YBesnard, JBell, AS Aliphatic acid amide derivative US Patent  US11339151 Publication Date 5/24/2022 
Target
Name:
5-hydroxytryptamine receptor 2A
Synonyms:
5-HT-2 5-HT2A 5-hydroxytryptamine receptor 2A (5HT-2A) 5HT2A_HUMAN HTR2A | Serotonin receptor 2A
Type:
undefined
Mol. Mass.:
52607.65
Organism:
Homo sapiens (Human)
Description:
P28223
Residue:
471
  
Inhibitor
Name:
BDBM555031
Synonyms:
US11339151, Example 7
Type:
Small organic molecule
Emp. Form.:
C21H30FN3O3
Mol. Mass.:
391.4796
SMILES:
CCN(CCN1CCC(CC1)c1noc2cc(F)ccc12)C(=O)C(C)(C)CO
: