Target
15-hydroxyprostaglandin dehydrogenase [NAD(+)]
Ligand
BDBM556300
Substrate
Meas. Tech.
Biochemical Assay
IC50
1.80±n/a nM
Citation
 Rai, RBooth, RGreen, MJ PGDH inhibitors and methods of making and using US Patent  US11345702 Publication Date 5/31/2022 
Target
Name:
15-hydroxyprostaglandin dehydrogenase [NAD(+)]
Synonyms:
15-PGDH HPGD PGDH_HUMAN SDR36C1
Type:
Enzyme
Mol. Mass.:
28974.46
Organism:
Homo sapiens (Human)
Description:
P15428
Residue:
266
  
Inhibitor
Name:
BDBM556300
Synonyms:
US11345702, Table 1.18 | US20230390274, Compound A-26
Type:
Small organic molecule
Emp. Form.:
C22H22ClN3O3
Mol. Mass.:
411.881
SMILES:
CCOC(=O)c1nc2cc(ccc2n1-c1cccc(Cl)c1)C(=O)N1CCCCC1
: