Target
Cyclin-dependent kinase 4
Ligand
BDBM556326
Substrate
Meas. Tech.
CDK4 Inhibition Assay
IC50
0.730±n/a nM
Citation
 Song, YChen, X Substituted pyrimidines as CDK4/6 inhibitors US Patent  US11351170 Publication Date 6/7/2022 
Target
Name:
Cyclin-dependent kinase 4
Synonyms:
CDK4 Cell division protein kinase 4 PSK-J3
Type:
Enzyme Subunit
Mol. Mass.:
33731.96
Organism:
Homo sapiens (Human)
Description:
P11802
Residue:
303
  
Inhibitor
Name:
BDBM556326
Synonyms:
1-(4-((6-(5-fluoro-4-(5-fluoro-1,1-dimethyl-2,3-dihydro-1H-benzo[d]pyrrolo[1,2-a]imidazol-7-yl)pyrimidin-2-ylamino)pyridin-3-yl)methyl)piperazin-1-yl)-2-hydroxyethanone (Compound 22) | US11351170, Example 2
Type:
Small organic molecule
Emp. Form.:
C28H30F2N8O2
Mol. Mass.:
548.587
SMILES:
CC1(C)CCc2nc3c(F)cc(cc3n12)-c1nc(Nc2ccc(CN3CCN(CC3)C(=O)CO)cn2)ncc1F
: