Target
Cyclin-dependent kinase 4
Ligand
BDBM556327
Substrate
Meas. Tech.
CDK4 Inhibition Assay
IC50
0.200±n/a nM
Citation
 Song, YChen, X Substituted pyrimidines as CDK4/6 inhibitors US Patent  US11351170 Publication Date 6/7/2022 
Target
Name:
Cyclin-dependent kinase 4
Synonyms:
CDK4 Cell division protein kinase 4 PSK-J3
Type:
Enzyme Subunit
Mol. Mass.:
33731.96
Organism:
Homo sapiens (Human)
Description:
P11802
Residue:
303
  
Inhibitor
Name:
BDBM556327
Synonyms:
(S)-(3-(dimethylamino)pyrrolidin-1-yl)(6-(5-fluoro-4-(5-fluoro-1,1-dimethyl-2,3-dihydro-1H-benzo[d]pyrrolo[1,2-a]imidazol-7-yl)pyrimidin-2-ylamino)pyridin-3-yl)methanone | US11351170, Example 6
Type:
Small organic molecule
Emp. Form.:
C28H30F2N8O
Mol. Mass.:
532.5876
SMILES:
CN(C)[C@H]1CCN(C1)C(=O)c1ccc(Nc2ncc(F)c(n2)-c2cc(F)c3nc4CCC(C)(C)n4c3c2)nc1
: