Target
Cyclin-dependent kinase 4
Ligand
BDBM556329
Substrate
Meas. Tech.
CDK4 Inhibition Assay
IC50
0.160±n/a nM
Citation
 Song, YChen, X Substituted pyrimidines as CDK4/6 inhibitors US Patent  US11351170 Publication Date 6/7/2022 
Target
Name:
Cyclin-dependent kinase 4
Synonyms:
CDK4 Cell division protein kinase 4 PSK-J3
Type:
Enzyme Subunit
Mol. Mass.:
33731.96
Organism:
Homo sapiens (Human)
Description:
P11802
Residue:
303
  
Inhibitor
Name:
BDBM556329
Synonyms:
N-(5-((1-ethylpiperidin-4-yl)methoxy)pyridin-2-yl)-5-fluoro-4-(5-fluoro-1,1-dimethyl-2,3-dihydro-1H-benzo[d]pyrrolo[1,2-a]imidazol-7-yl)pyrimidin-2-amine (Compound 57) | US11351170, Example 8
Type:
Small organic molecule
Emp. Form.:
C29H33F2N7O
Mol. Mass.:
533.6154
SMILES:
CCN1CCC(COc2ccc(Nc3ncc(F)c(n3)-c3cc(F)c4nc5CCC(C)(C)n5c4c3)nc2)CC1
: