Target
Cyclin-dependent kinase 2
Ligand
BDBM556330
Substrate
Meas. Tech.
CDK2 Inhibition Assay
IC50
24.7±n/a nM
Citation
 Song, YChen, X Substituted pyrimidines as CDK4/6 inhibitors US Patent  US11351170 Publication Date 6/7/2022 
Target
Name:
Cyclin-dependent kinase 2
Synonyms:
CDK2 CDK2_HUMAN Cell division protein kinase 2 Protein cereblon/Cyclin-dependent kinase 2 | p33 protein kinase
Type:
Enzyme Subunit
Mol. Mass.:
33938.17
Organism:
Homo sapiens (Human)
Description:
P24941
Residue:
298
  
Inhibitor
Name:
BDBM556330
Synonyms:
N-(5-((1-ethylpiperidin-4-yl)methoxy)pyridin-2-yl)-5-fluoro-4-(5-fluoro-1,1-dimethyl-2,3-dihydro-1H-benzo[d]pyrrolo[1,2-a]imidazol-7-yl)pyridin-2-amine (Compound 60) | US11351170, Example 9
Type:
Small organic molecule
Emp. Form.:
C30H34F2N6O
Mol. Mass.:
532.6274
SMILES:
CCN1CCC(COc2ccc(Nc3cc(c(F)cn3)-c3cc(F)c4nc5CCC(C)(C)n5c4c3)nc2)CC1
: