Target
Cyclin-dependent kinase 2
Ligand
BDBM556331
Substrate
Meas. Tech.
CDK2 Inhibition Assay
IC50
64.1±n/a nM
Citation
 Song, YChen, X Substituted pyrimidines as CDK4/6 inhibitors US Patent  US11351170 Publication Date 6/7/2022 
Target
Name:
Cyclin-dependent kinase 2
Synonyms:
CDK2 CDK2_HUMAN Cell division protein kinase 2 Protein cereblon/Cyclin-dependent kinase 2 | p33 protein kinase
Type:
Enzyme Subunit
Mol. Mass.:
33938.17
Organism:
Homo sapiens (Human)
Description:
P24941
Residue:
298
  
Inhibitor
Name:
BDBM556331
Synonyms:
5-fluoro-4-(5-fluoro-1,1-dimethyl-2,3-dihydro-1H-benzo[d]pyrrolo[1,2-a]imidazol-7-yl)-N-(5-(1-methylpiperidin-4-yloxy)pyridin-2-yl)pyrimidin-2-amine (Compound 65) | US11351170, Example 10
Type:
Small organic molecule
Emp. Form.:
C27H29F2N7O
Mol. Mass.:
505.5623
SMILES:
CN1CCC(CC1)Oc1ccc(Nc2ncc(F)c(n2)-c2cc(F)c3nc4CCC(C)(C)n4c3c2)nc1
: