Target
Cyclin-dependent kinase 6
Ligand
BDBM556334
Substrate
Meas. Tech.
CDK6 Inhibition Assay
IC50
1.02±n/a nM
Citation
 Song, YChen, X Substituted pyrimidines as CDK4/6 inhibitors US Patent  US11351170 Publication Date 6/7/2022 
Target
Name:
Cyclin-dependent kinase 6
Synonyms:
CDK6 CDKN6 Cyclin-dependent kinase 6 (CDK 6) | Serine/threonine-protein kinase PLSTIRE
Type:
Enzyme Subunit
Mol. Mass.:
36937.42
Organism:
Homo sapiens (Human)
Description:
Q00534
Residue:
326
  
Inhibitor
Name:
BDBM556334
Synonyms:
3-(4-((6-(5-fluoro-4-(5-fluoro-1,1-dimethyl-2,3-dihydro-1H-benzo[d]pyrrolo[1,2-a]imidazol-7-yl)pyrimidin-2-ylamino)pyridin-3-yloxy)methyl)piperidin-1-yl)propan-1-ol (Compound 72) | US11351170, Example 11
Type:
Small organic molecule
Emp. Form.:
C30H35F2N7O2
Mol. Mass.:
563.6414
SMILES:
CC1(C)CCc2nc3c(F)cc(cc3n12)-c1nc(Nc2ccc(OCC3CCN(CCCO)CC3)cn2)ncc1F
: