Target
Cyclin-dependent kinase 6
Ligand
BDBM556336
Substrate
Meas. Tech.
CDK6 Inhibition Assay
IC50
3.92±n/a nM
Citation
 Song, YChen, X Substituted pyrimidines as CDK4/6 inhibitors US Patent  US11351170 Publication Date 6/7/2022 
Target
Name:
Cyclin-dependent kinase 6
Synonyms:
CDK6 CDKN6 Cyclin-dependent kinase 6 (CDK 6) | Serine/threonine-protein kinase PLSTIRE
Type:
Enzyme Subunit
Mol. Mass.:
36937.42
Organism:
Homo sapiens (Human)
Description:
Q00534
Residue:
326
  
Inhibitor
Name:
BDBM556336
Synonyms:
5-fluoro-4-(5-fluoro-1,1-dimethyl-2,3-dihydro-1H-benzo[d]pyrrolo[1,2-a]imidazol-7-yl)-N-(5-((1-methylpiperidin-4-yloxy)methyl)pyridin-2-yl)pyrimidin-2-amine (Compound 81) | US11351170, Example 13
Type:
Small organic molecule
Emp. Form.:
C28H31F2N7O
Mol. Mass.:
519.5888
SMILES:
CN1CCC(CC1)OCc1ccc(Nc2ncc(F)c(n2)-c2cc(F)c3nc4CCC(C)(C)n4c3c2)nc1
: