Target
Cyclin-dependent kinase 2
Ligand
BDBM556337
Substrate
Meas. Tech.
CDK2 Inhibition Assay
IC50
70.3±n/a nM
Citation
 Song, YChen, X Substituted pyrimidines as CDK4/6 inhibitors US Patent  US11351170 Publication Date 6/7/2022 
Target
Name:
Cyclin-dependent kinase 2
Synonyms:
CDK2 CDK2_HUMAN Cell division protein kinase 2 Protein cereblon/Cyclin-dependent kinase 2 | p33 protein kinase
Type:
Enzyme Subunit
Mol. Mass.:
33938.17
Organism:
Homo sapiens (Human)
Description:
P24941
Residue:
298
  
Inhibitor
Name:
BDBM556337
Synonyms:
2-(4-(6-(5-fluoro-4-(5-fluoro-1,1-dimethyl-2,3-dihydro-1H-benzo[d]pyrrolo[1,2-a]imidazol-7-yl)pyrimidin-2-ylamino)pyridin-3-yloxy)piperidin-1-yl)ethanol (Compound 87) | US11351170, Example 14
Type:
Small organic molecule
Emp. Form.:
C28H31F2N7O2
Mol. Mass.:
535.5882
SMILES:
CC1(C)CCc2nc3c(F)cc(cc3n12)-c1nc(Nc2ccc(OC3CCN(CCO)CC3)cn2)ncc1F
: