Target
Cyclin-dependent kinase 6
Ligand
BDBM50455050
Substrate
Meas. Tech.
CDK6 Inhibition Assay
IC50
2.71±n/a nM
Citation
 Song, YChen, X Substituted pyrimidines as CDK4/6 inhibitors US Patent  US11351170 Publication Date 6/7/2022 
Target
Name:
Cyclin-dependent kinase 6
Synonyms:
CDK6 CDKN6 Cyclin-dependent kinase 6 (CDK 6) | Serine/threonine-protein kinase PLSTIRE
Type:
Enzyme Subunit
Mol. Mass.:
36937.42
Organism:
Homo sapiens (Human)
Description:
Q00534
Residue:
326
  
Inhibitor
Name:
BDBM50455050
Synonyms:
CHEMBL4208172 US11351170, Example 1
Type:
Small organic molecule
Emp. Form.:
C28H32F2N8
Mol. Mass.:
518.6041
SMILES:
CCN1CCN(Cc2ccc(Nc3ncc(F)c(n3)-c3cc(F)c4nc5CCC(C)(C)n5c4c3)nc2)CC1
: