Target
Cyclin-dependent kinase 2
Ligand
BDBM50455050
Substrate
Meas. Tech.
CDK2 Inhibition Assay
IC50
51.1±n/a nM
Citation
 Song, YChen, X Substituted pyrimidines as CDK4/6 inhibitors US Patent  US11351170 Publication Date 6/7/2022 
Target
Name:
Cyclin-dependent kinase 2
Synonyms:
CDK2 CDK2_HUMAN Cell division protein kinase 2 Protein cereblon/Cyclin-dependent kinase 2 | p33 protein kinase
Type:
Enzyme Subunit
Mol. Mass.:
33938.17
Organism:
Homo sapiens (Human)
Description:
P24941
Residue:
298
  
Inhibitor
Name:
BDBM50455050
Synonyms:
CHEMBL4208172 US11351170, Example 1
Type:
Small organic molecule
Emp. Form.:
C28H32F2N8
Mol. Mass.:
518.6041
SMILES:
CCN1CCN(Cc2ccc(Nc3ncc(F)c(n3)-c3cc(F)c4nc5CCC(C)(C)n5c4c3)nc2)CC1
: