Target
Cyclin-dependent kinase 6
Ligand
BDBM448950
Substrate
Meas. Tech.
CDK6 Inhibition Assay
IC50
1.93±n/a nM
Citation
 Song, YChen, X Substituted pyrimidines as CDK4/6 inhibitors US Patent  US11351170 Publication Date 6/7/2022 
Target
Name:
Cyclin-dependent kinase 6
Synonyms:
CDK6 CDKN6 Cyclin-dependent kinase 6 (CDK 6) | Serine/threonine-protein kinase PLSTIRE
Type:
Enzyme Subunit
Mol. Mass.:
36937.42
Organism:
Homo sapiens (Human)
Description:
Q00534
Residue:
326
  
Inhibitor
Name:
BDBM448950
Synonyms:
N-(5-(1-Ethylpiperidine-4-yl)pyridin-2-yl)-5-fluoro-4-(5-fluoro-1,1-dimethyl-2,3-dihydro-1H-benzo[d]pyrrolo[1,2-a]imidazol-7-yl)pyrimidin-2-amine US11351170, Example 4
Type:
Small organic molecule
Emp. Form.:
C28H31F2N7
Mol. Mass.:
503.5894
SMILES:
CCN1CCC(CC1)c1ccc(Nc2ncc(F)c(n2)-c2cc(F)c3nc4CCC(C)(C)n4c3c2)nc1
: