Target
Cyclin-dependent kinase 6
Ligand
BDBM448926
Substrate
Meas. Tech.
CDK6 Inhibition Assay
IC50
1.87±n/a nM
Citation
 Song, YChen, X Substituted pyrimidines as CDK4/6 inhibitors US Patent  US11351170 Publication Date 6/7/2022 
Target
Name:
Cyclin-dependent kinase 6
Synonyms:
CDK6 CDKN6 Cyclin-dependent kinase 6 (CDK 6) | Serine/threonine-protein kinase PLSTIRE
Type:
Enzyme Subunit
Mol. Mass.:
36937.42
Organism:
Homo sapiens (Human)
Description:
Q00534
Residue:
326
  
Inhibitor
Name:
BDBM448926
Synonyms:
1-(2-((5-Fluoro-4-(5-fluoro-1,1-dimethyl-2,3-dihydro-1H-benzo[d]pyrrolo[1,2-a]imidazol-7-yl)pyrimidin-2-yl)amino)-7,8-dihydro-1,6-naphthyridin-6(5H)-yl)-2-hydroxyethan-1-one US11351170, Example 5
Type:
Small organic molecule
Emp. Form.:
C26H25F2N7O2
Mol. Mass.:
505.5192
SMILES:
CC1(C)CCc2nc3c(F)cc(cc3n12)-c1nc(Nc2ccc3CN(CCc3n2)C(=O)CO)ncc1F
: