Target
Cytochrome P450 4F2
Ligand
BDBM558357
Substrate
Meas. Tech.
Inhibition Test for Each Compound of the Present Invention Against 20-HETE Producing Enzymes (CYP4F2 and CYP4A11)
IC50
32.0±n/a nM
Citation
 Tanaka, HKawamura, MHamada, MKobashi, YIto, YSuzuki, KBohno, AFunayama, K Pyridine compound substituted with azole US Patent  US11365192 Publication Date 6/21/2022 
Target
Name:
Cytochrome P450 4F2
Synonyms:
20-HETE synthase Arachidonic acid omega-hydroxylase CYP4F2 Cytochrome P450 4F2 Leukotriene-B(4) 20-monooxygenase 1 Phylloquinone omega-hydroxylase CYP4F2
Type:
PROTEIN
Mol. Mass.:
59859.32
Organism:
Homo sapiens (Human)
Description:
ChEMBL_10743
Residue:
520
  
Inhibitor
Name:
BDBM558357
Synonyms:
US11365192, Example 43-11
Type:
Small organic molecule
Emp. Form.:
C24H27N5O3
Mol. Mass.:
433.5029
SMILES:
O=C(CCc1cccc(COc2ccc(nc2)-c2ccn[nH]2)c1)NCC(=O)N1CCCC1
: