Target
Methylosome protein 50/Protein arginine N-methyltransferase 5
Ligand
BDBM558758
Substrate
Meas. Tech.
PRMT5 Inhibition Based on TR-FRET Assay
IC50
100.0±n/a nM
Citation
 Chikkanna, DPanigrahi, SKSammeta, SRGerd, WMikko, M Imidazolidin-2-one compounds as PRMT5 modulators US Patent  US11365205 Publication Date 6/21/2022 
Target
Name:
Methylosome protein 50/Protein arginine N-methyltransferase 5
Synonyms:
PRMT5 PRMT5/MEP50 Enzyme | PRMT5/MEP50 complex
Type:
Protein
Mol. Mass.:
Description:
Components:
This complex has 2 components.
Component 1
Name:
Protein arginine N-methyltransferase 5
Synonyms:
72 kDa ICln-binding protein HRMT1L5 IBP72 Jak-binding protein 1 PRMT5/MEP50 complex Protein arginine methyltransferase 5 (PRMT5) SKB1 homolog Shk1 kinase-binding protein 1 homolog
Type:
Enzyme
Mol. Mass.:
72679.99
Organism:
Homo sapiens (Human)
Description:
O14744
Residue:
637
  
Component 2
Name:
Methylosome protein 50
Synonyms:
Androgen receptor cofactor p44 MEP50 Nbla10071 WD45 p44/Mep50
Type:
Enzyme
Mol. Mass.:
36713.38
Organism:
Homo sapiens (Human)
Description:
Q9BQA1
Residue:
342
  
Inhibitor
Name:
BDBM558758
Synonyms:
1-(3-(3,4-dihydroisoquinolin-2(1H)-yl)-2-hydroxypropyl)-3-((6-isopropylpyridin- | US11365205, Example 26
Type:
Small organic molecule
Emp. Form.:
C24H30N4O2
Mol. Mass.:
406.5206
SMILES:
CC(=C)c1ccc(CN2CCN(CC(O)CN3CCc4ccccc4C3)C2=O)cn1
: