Target
Arginase-2, mitochondrial
Ligand
BDBM290403
Substrate
IC50
125±n/a nM
Citation
 Van Zandt, MJagdmann, GE Arginase inhibitors as therapeutics US Patent  US11389464 Publication Date 7/19/2022 
Target
Name:
Arginase-2, mitochondrial
Synonyms:
ARG2 Arginase II Non-hepatic arginase | Type II arginase
Type:
PROTEIN
Mol. Mass.:
38576.93
Organism:
Homo sapiens (Human)
Description:
ChEMBL_978892
Residue:
354
  
Inhibitor
Name:
BDBM290403
Synonyms:
(3R,4S)-3-amino-4-(3-boronopropyl)-1-(((S)-1,2,3,4- tetrahydroisoquinolin-3-yl)methyl)pyrrolidine-3-carboxylic acid US10603330, Example 39 | US11389464, Example 39
Type:
Small organic molecule
Emp. Form.:
C18H28BN3O4
Mol. Mass.:
361.244
SMILES:
N[C@]1(CN(C[C@@H]2Cc3ccccc3CN2)C[C@@H]1CCCB(O)O)C(O)=O
: