Target
Cyclin-dependent kinase 6/G1/S-specific cyclin-D1 [L188C]
Ligand
BDBM370115
Substrate
Meas. Tech.
CDK6/Cyclin D1 Mobility Shift Assay
Ki
0.120±n/a nM
Citation
 Behenna, DCChen, PFreeman-Cook, KDHoffman, RLJalaie, MNagata, ANair, SKNinkovic, SOrnelas, MAPalmer, CLRui, EY CDK2/4/6 inhibitors US Patent  US11396512 Publication Date 7/26/2022 
Target
Name:
Cyclin-dependent kinase 6/G1/S-specific cyclin-D1 [L188C]
Synonyms:
CDK6/Cyclin D | Cyclin-Dependent Kinase 6 (CDK6)
Type:
Protein Complex
Mol. Mass.:
Description:
Components:
This complex has 2 components.
Component 1
Name:
Cyclin-dependent kinase 6
Synonyms:
CDK6 CDKN6 Cyclin-dependent kinase 6 (CDK 6) | Serine/threonine-protein kinase PLSTIRE
Type:
Enzyme Subunit
Mol. Mass.:
36937.42
Organism:
Homo sapiens (Human)
Description:
Q00534
Residue:
326
  
Component 2
Name:
G1/S-specific cyclin-D1 [L188C]
Synonyms:
BCL1 CCND1_HUMAN PRAD1
Type:
Enzyme Subunit
Mol. Mass.:
33634.57
Organism:
Homo sapiens (Human)
Description:
P24385[L188C]
Residue:
295
  
Inhibitor
Name:
BDBM370115
Synonyms:
4-({6-(2-hydroxyethyl)-8-[(1R,2S)-2-methylcyclopentyl]-7-oxo-7,8-dihydropyrido[2,3-d]pyrimidin-2-yl}amino)-N-methylpiperidine-1-sulfonamide US10800783, Example 4 | US11396512, Example 4
Type:
Small organic molecule
Emp. Form.:
C21H32N6O4S
Mol. Mass.:
464.582
SMILES:
CNS(=O)(=O)N1CCC(CC1)Nc1ncc2cc(CCO)c(=O)n([C@@H]3CCC[C@@H]3C)c2n1
: