Target
Cyclin-dependent kinase 6/G1/S-specific cyclin-D1 [L188C]
Ligand
BDBM370163
Substrate
Meas. Tech.
CDK6/Cyclin D1 Mobility Shift Assay
Ki
0.130±n/a nM
Citation
 Behenna, DCChen, PFreeman-Cook, KDHoffman, RLJalaie, MNagata, ANair, SKNinkovic, SOrnelas, MAPalmer, CLRui, EY CDK2/4/6 inhibitors US Patent  US11396512 Publication Date 7/26/2022 
Target
Name:
Cyclin-dependent kinase 6/G1/S-specific cyclin-D1 [L188C]
Synonyms:
CDK6/Cyclin D | Cyclin-Dependent Kinase 6 (CDK6)
Type:
Protein Complex
Mol. Mass.:
Description:
Components:
This complex has 2 components.
Component 1
Name:
Cyclin-dependent kinase 6
Synonyms:
CDK6 CDKN6 Cyclin-dependent kinase 6 (CDK 6) | Serine/threonine-protein kinase PLSTIRE
Type:
Enzyme Subunit
Mol. Mass.:
36937.42
Organism:
Homo sapiens (Human)
Description:
Q00534
Residue:
326
  
Component 2
Name:
G1/S-specific cyclin-D1 [L188C]
Synonyms:
BCL1 CCND1_HUMAN PRAD1
Type:
Enzyme Subunit
Mol. Mass.:
33634.57
Organism:
Homo sapiens (Human)
Description:
P24385[L188C]
Residue:
295
  
Inhibitor
Name:
BDBM370163
Synonyms:
US10233188, Example 51 US11396512, Example 51
Type:
Small organic molecule
Emp. Form.:
C20H29N5O4S
Mol. Mass.:
435.54
SMILES:
C[C@@H]1CCC[C@@H]1n1c2nc(NC3CCN(CC3)S(C)(=O)=O)ncc2cc(CO)c1=O
: