Target
Cyclin-dependent kinase 2/G1/S-specific cyclin-E1
Ligand
BDBM370187
Substrate
Meas. Tech.
CDK2/Cyclin E1 Mobility Shift Assay
Ki
0.200±n/a nM
Citation
 Behenna, DCChen, PFreeman-Cook, KDHoffman, RLJalaie, MNagata, ANair, SKNinkovic, SOrnelas, MAPalmer, CLRui, EY CDK2/4/6 inhibitors US Patent  US11396512 Publication Date 7/26/2022 
Target
Name:
Cyclin-dependent kinase 2/G1/S-specific cyclin-E1
Synonyms:
CDK2/CycE CDK2/E Cyclin-Dependent Kinase 2 (CDK2) Cyclin-dependent kinase 2/cyclin E1
Type:
Protein
Mol. Mass.:
Description:
Components:
This complex has 2 components.
Component 1
Name:
Cyclin-dependent kinase 2
Synonyms:
CDK2 CDK2_HUMAN Cell division protein kinase 2 Protein cereblon/Cyclin-dependent kinase 2 | p33 protein kinase
Type:
Enzyme Subunit
Mol. Mass.:
33938.17
Organism:
Homo sapiens (Human)
Description:
P24941
Residue:
298
  
Component 2
Name:
G1/S-specific cyclin-E1
Synonyms:
CCNE CCNE1_HUMAN
Type:
Enzyme Subunit
Mol. Mass.:
47073.17
Organism:
Homo sapiens (Human)
Description:
Residue:
410
  
Inhibitor
Name:
BDBM370187
Synonyms:
US10233188, Example 74 US11396512, Example 74
Type:
Small organic molecule
Emp. Form.:
C21H29N5O4S
Mol. Mass.:
447.551
SMILES:
C[C@@]1(O)CCC[C@H]1n1c2nc(NC3CCN(CC3)S(=O)(=O)C3CC3)ncc2ccc1=O
: