Target
Lysine-specific histone demethylase 1A
Ligand
BDBM388904
Substrate
Meas. Tech.
Biochemical Assay
IC50
275±n/a nM
Citation
 He, CLi, ZWu, LYao, WZhang, F Heterocyclic compounds as LSD1 inhibitors US Patent  US11401272 Publication Date 8/2/2022 
Target
Name:
Lysine-specific histone demethylase 1A
Synonyms:
AOF2 Flavin-containing amine oxidase domain-containing protein 2 KDM1A KIAA0601 Lysine-specific demethylase 1 (LSD1) Lysine-specific histone demethylase 1 (LSD1)
Type:
Enzyme
Mol. Mass.:
92901.01
Organism:
Homo sapiens (Human)
Description:
O60341
Residue:
852
  
Inhibitor
Name:
BDBM388904
Synonyms:
4-(8-(1-methyl-1H-benzimidazol-5-yl)-5-{[(3R)-1-methylpyrrolidin-3-yl]methoxy}imidazo[1,2-c]pyrimidin-7-yl)benzonitrile US11401272, Example 25 | US9944647, Example 25
Type:
Small organic molecule
Emp. Form.:
C27H25N7O
Mol. Mass.:
463.5337
SMILES:
CN1CC[C@@H](COc2nc(-c3ccc(cc3)C#N)c(-c3ccc4n(C)cnc4c3)c3nccn23)C1
: