Target
Apoptosis regulator Bcl-2
Ligand
BDBM567670
Substrate
Meas. Tech.
Bcl-2/Bcl-X TR-FRET Assay
IC50
0.041±n/a nM
Citation
 Guo, YXue, HWang, ZSun, H Bcl-2 inhibitors US Patent  US11420968 Publication Date 8/23/2022 
Target
Name:
Apoptosis regulator Bcl-2
Synonyms:
Apoptosis regulator Bcl-2 Protein BCL-2 BCL2_HUMAN | Bcl-2 Protein
Type:
Homodimer or heterodimer
Mol. Mass.:
26269.11
Organism:
Homo sapiens (Human)
Description:
P10415
Residue:
239
  
Inhibitor
Name:
BDBM567670
Synonyms:
US11420968, Example F37
Type:
Small organic molecule
Emp. Form.:
C46H51N7O8S
Mol. Mass.:
862.004
SMILES:
[O-][N+](=O)c1cc(ccc1NC[C@H]1COCCO1)S(=O)(=O)NC(=O)c1ccc(cc1Oc1cnc2[nH]ccc2c1)N1CCC2(CC(C2)N2CCC[C@H]2c2ccccc2C2CC2)CC1
: