Target
Apoptosis regulator Bcl-2
Ligand
BDBM567676
Substrate
Meas. Tech.
Bcl-2/Bcl-X TR-FRET Assay
IC50
0.015±n/a nM
Citation
 Guo, YXue, HWang, ZSun, H Bcl-2 inhibitors US Patent  US11420968 Publication Date 8/23/2022 
Target
Name:
Apoptosis regulator Bcl-2
Synonyms:
Apoptosis regulator Bcl-2 Protein BCL-2 BCL2_HUMAN | Bcl-2 Protein
Type:
Homodimer or heterodimer
Mol. Mass.:
26269.11
Organism:
Homo sapiens (Human)
Description:
P10415
Residue:
239
  
Inhibitor
Name:
BDBM567676
Synonyms:
US11420968, Example F42 | US11420970, Example 1
Type:
Small organic molecule
Emp. Form.:
C23H25FN8O
Mol. Mass.:
448.496
SMILES:
COc1ccc(cc1F)-c1cc(Cn2cnc3c(N)ncnc23)c(cn1)N1CCC[C@@H](N)C1
: