Target
Apoptosis regulator Bcl-2
Ligand
BDBM567679
Substrate
Meas. Tech.
Bcl-2/Bcl-X TR-FRET Assay
IC50
0.036±n/a nM
Citation
 Guo, YXue, HWang, ZSun, H Bcl-2 inhibitors US Patent  US11420968 Publication Date 8/23/2022 
Target
Name:
Apoptosis regulator Bcl-2
Synonyms:
Apoptosis regulator Bcl-2 Protein BCL-2 BCL2_HUMAN | Bcl-2 Protein
Type:
Homodimer or heterodimer
Mol. Mass.:
26269.11
Organism:
Homo sapiens (Human)
Description:
P10415
Residue:
239
  
Inhibitor
Name:
BDBM567679
Synonyms:
US11420968, Example F45
Type:
Small organic molecule
Emp. Form.:
C47H55N7O7S
Mol. Mass.:
862.047
SMILES:
CC(C)c1ccccc1[C@@H]1CCCN1C1CC2(C1)CCN(CC2)c1ccc(C(=O)NS(=O)(=O)c2ccc(NCC3CCOCC3)c(c2)[N+]([O-])=O)c(Oc2cnc3[nH]ccc3c2)c1
: