Target
Apoptosis regulator Bcl-2
Ligand
BDBM567750
Substrate
Meas. Tech.
Bcl-2/Bcl-X TR-FRET Assay
IC50
0.045±n/a nM
Citation
 Guo, YXue, HWang, ZSun, H Bcl-2 inhibitors US Patent  US11420968 Publication Date 8/23/2022 
Target
Name:
Apoptosis regulator Bcl-2
Synonyms:
Apoptosis regulator Bcl-2 Protein BCL-2 BCL2_HUMAN | Bcl-2 Protein
Type:
Homodimer or heterodimer
Mol. Mass.:
26269.11
Organism:
Homo sapiens (Human)
Description:
P10415
Residue:
239
  
Inhibitor
Name:
BDBM567750
Synonyms:
US11420968, Example F112
Type:
Small organic molecule
Emp. Form.:
C43H47N7O8S
Mol. Mass.:
821.94
SMILES:
CCc1ccccc1[C@@H]1CCCN1C1CC2(C1)CN(C2)c1ccc(C(=O)NS(=O)(=O)c2ccc(NC[C@H]3COCCO3)c(c2)[N+]([O-])=O)c(Oc2cnc3[nH]ccc3c2)c1
: