Target
Apoptosis regulator Bcl-2
Ligand
BDBM567769
Substrate
Meas. Tech.
Bcl-2/Bcl-X TR-FRET Assay
IC50
0.021±n/a nM
Citation
 Guo, YXue, HWang, ZSun, H Bcl-2 inhibitors US Patent  US11420968 Publication Date 8/23/2022 
Target
Name:
Apoptosis regulator Bcl-2
Synonyms:
Apoptosis regulator Bcl-2 Protein BCL-2 BCL2_HUMAN | Bcl-2 Protein
Type:
Homodimer or heterodimer
Mol. Mass.:
26269.11
Organism:
Homo sapiens (Human)
Description:
P10415
Residue:
239
  
Inhibitor
Name:
BDBM567769
Synonyms:
US11420968, Example F130
Type:
Small organic molecule
Emp. Form.:
C49H58N8O7S
Mol. Mass.:
903.099
SMILES:
CCN1CCN(C2CC3(C2)CCN(CC3)c2ccc(C(=O)NS(=O)(=O)c3ccc(NCC4CCOCC4)c(c3)[N+]([O-])=O)c(Oc3cnc4[nH]ccc4c3)c2)C(C1)c1ccccc1C1CC1
: