Target
Apoptosis regulator Bcl-2
Ligand
BDBM567770
Substrate
Meas. Tech.
Bcl-2/Bcl-X TR-FRET Assay
IC50
0.046±n/a nM
Citation
 Guo, YXue, HWang, ZSun, H Bcl-2 inhibitors US Patent  US11420968 Publication Date 8/23/2022 
Target
Name:
Apoptosis regulator Bcl-2
Synonyms:
Apoptosis regulator Bcl-2 Protein BCL-2 BCL2_HUMAN | Bcl-2 Protein
Type:
Homodimer or heterodimer
Mol. Mass.:
26269.11
Organism:
Homo sapiens (Human)
Description:
P10415
Residue:
239
  
Inhibitor
Name:
BDBM567770
Synonyms:
US11420968, Example F131a | US11420968, Example F131b
Type:
Small organic molecule
Emp. Form.:
C46H51N7O8S
Mol. Mass.:
862.004
SMILES:
OC1COC(CNc2ccc(cc2[N+]([O-])=O)S(=O)(=O)NC(=O)c2ccc(cc2Oc2cnc3[nH]ccc3c2)N2CCC3(CC(C3)N3CCC[C@H]3c3ccccc3C3CC3)CC2)C1
: