Target
Apoptosis regulator Bcl-2
Ligand
BDBM567421
Substrate
Meas. Tech.
Bcl-2/Bcl-X TR-FRET Assay
IC50
0.045±n/a nM
Citation
 Guo, YXue, HWang, ZSun, H Bcl-2 inhibitors US Patent  US11420968 Publication Date 8/23/2022 
Target
Name:
Apoptosis regulator Bcl-2
Synonyms:
Apoptosis regulator Bcl-2 Protein BCL-2 BCL2_HUMAN | Bcl-2 Protein
Type:
Homodimer or heterodimer
Mol. Mass.:
26269.11
Organism:
Homo sapiens (Human)
Description:
P10415
Residue:
239
  
Inhibitor
Name:
BDBM567421
Synonyms:
US11420968, Example F5
Type:
Small organic molecule
Emp. Form.:
C44H40N6O7S2
Mol. Mass.:
828.954
SMILES:
[O-][N+](=O)c1cc(ccc1NCC1CCOCC1)S(=O)(=O)NC(=O)c1ccc(cc1Oc1cnc2[nH]ccc2c1)-c1cc2cc(ccc2s1)N1CCC[C@@H]1c1ccccc1
: