Target
Apoptosis regulator Bcl-2
Ligand
BDBM567744
Substrate
Meas. Tech.
Bcl-2/Bcl-X TR-FRET Assay
IC50
0.021±n/a nM
Citation
 Guo, YXue, HWang, ZSun, H Bcl-2 inhibitors US Patent  US11420968 Publication Date 8/23/2022 
Target
Name:
Apoptosis regulator Bcl-2
Synonyms:
Apoptosis regulator Bcl-2 Protein BCL-2 BCL2_HUMAN | Bcl-2 Protein
Type:
Homodimer or heterodimer
Mol. Mass.:
26269.11
Organism:
Homo sapiens (Human)
Description:
P10415
Residue:
239
  
Inhibitor
Name:
BDBM567744
Synonyms:
US11420968, Example F106
Type:
Small organic molecule
Emp. Form.:
C47H53N7O7S
Mol. Mass.:
860.031
SMILES:
C[C@]1(O)CC[C@H](CNc2ccc(cc2[N+]([O-])=O)S(=O)(=O)NC(=O)c2ccc(cc2Oc2cnc3[nH]ccc3c2)N2CC3(CC(C3)N3CCC[C@H]3c3ccccc3C3CC3)C2)CC1
: