Target
Histone-lysine N-methyltransferase NSD2
Ligand
BDBM567821
Substrate
Meas. Tech.
LC-MS/MS-Based NSD2 Enzymatic Assay
IC50
5.5±n/a nM
Citation
 Deng, HLiu, JOyang, CWang, CXiao, QXun, GZeng, H Piperidinyl-methyl-purineamines as NSD2 inhibitors and anti-cancer agents US Patent  US11420970 Publication Date 8/23/2022 
Target
Name:
Histone-lysine N-methyltransferase NSD2
Synonyms:
KIAA1090 NSD2 Nuclear SET domain-containing protein 2 (NSD2) WHSC1
Type:
Protein
Mol. Mass.:
152327.31
Organism:
Homo sapiens (Human)
Description:
O96028
Residue:
1365
  
Inhibitor
Name:
BDBM567821
Synonyms:
US11420970, Example 22
Type:
Small organic molecule
Emp. Form.:
C42H53F2N7O7
Mol. Mass.:
805.9097
SMILES:
CC(C)(C)OC(=O)NC1(COC2CC2)CCCC(C1)c1cnc(cc1Cn1cnc2c(ncnc12)N(C(=O)OC(C)(C)C)C(=O)OC(C)(C)C)-c1ccc(F)c(F)c1
: