Target
Histone-lysine N-methyltransferase NSD2
Ligand
BDBM567977
Substrate
Meas. Tech.
LC-MS/MS-Based NSD2 Enzymatic Assay
IC50
5.5±n/a nM
Citation
 Deng, HLiu, JOyang, CWang, CXiao, QXun, GZeng, H Piperidinyl-methyl-purineamines as NSD2 inhibitors and anti-cancer agents US Patent  US11420970 Publication Date 8/23/2022 
Target
Name:
Histone-lysine N-methyltransferase NSD2
Synonyms:
KIAA1090 NSD2 Nuclear SET domain-containing protein 2 (NSD2) WHSC1
Type:
Protein
Mol. Mass.:
152327.31
Organism:
Homo sapiens (Human)
Description:
O96028
Residue:
1365
  
Inhibitor
Name:
BDBM567977
Synonyms:
US11420970, Example 178
Type:
Small organic molecule
Emp. Form.:
C28H27F2N9O
Mol. Mass.:
543.5705
SMILES:
COc1cccc(n1)[C@@]1(N)CCCN(C1)c1cnc(cc1Cn1cnc2c(N)ncnc12)-c1ccc(F)c(F)c1
: