Target
Histone-lysine N-methyltransferase NSD2
Ligand
BDBM568024
Substrate
Meas. Tech.
LC-MS/MS-Based NSD2 Enzymatic Assay
IC50
5.5±n/a nM
Citation
 Deng, HLiu, JOyang, CWang, CXiao, QXun, GZeng, H Piperidinyl-methyl-purineamines as NSD2 inhibitors and anti-cancer agents US Patent  US11420970 Publication Date 8/23/2022 
Target
Name:
Histone-lysine N-methyltransferase NSD2
Synonyms:
KIAA1090 NSD2 Nuclear SET domain-containing protein 2 (NSD2) WHSC1
Type:
Protein
Mol. Mass.:
152327.31
Organism:
Homo sapiens (Human)
Description:
O96028
Residue:
1365
  
Inhibitor
Name:
BDBM568024
Synonyms:
US11420970, Example 226
Type:
Small organic molecule
Emp. Form.:
C28H26F3N9
Mol. Mass.:
545.5615
SMILES:
Nc1ncnc2n(Cc3cc(ncc3N3CCC[C@@](N)(C3)c3cccc(CF)n3)-c3ccc(F)c(F)c3)cnc12
: