Target
Egl nine homolog 1 [179-426]
Ligand
BDBM301787
Substrate
Meas. Tech.
EGLN-1 Activity Assay
IC50
5800±n/a nM
Citation
 Kawamoto, RMWu, SEvdokimov, AGGreis, KDBoyer, ASWarshakoon, NC Prolyl hydroxylase inhibitors and methods of use US Patent  US11426393 Publication Date 8/30/2022 
Target
Name:
Egl nine homolog 1 [179-426]
Synonyms:
C1orf12 EGLN1_HUMAN | Hypoxia-inducible factor prolyl hydroxylase 2 (HIFPH2)
Type:
Mol. Mass.:
27759.84
Organism:
Homo sapiens (Human)
Description:
EGLN-1-179/426
Residue:
248
  
Inhibitor
Name:
BDBM301787
Synonyms:
US11426393, Compound Table XV.3 USRE47437, Example {[5-(4-Cyano-phenyl)-3-hydroxy-pyridine-2-carbonyl]-amino}-acetic acid methyl ester
Type:
Small organic molecule
Emp. Form.:
C16H13N3O4
Mol. Mass.:
311.2921
SMILES:
COC(=O)CNC(=O)c1ncc(cc1O)-c1ccc(cc1)C#N
: