Target
Egl nine homolog 1 [179-426]
Ligand
BDBM107699
Substrate
Meas. Tech.
EGLN-1 Activity Assay
IC50
20000±n/a nM
Citation
 Kawamoto, RMWu, SEvdokimov, AGGreis, KDBoyer, ASWarshakoon, NC Prolyl hydroxylase inhibitors and methods of use US Patent  US11426393 Publication Date 8/30/2022 
Target
Name:
Egl nine homolog 1 [179-426]
Synonyms:
C1orf12 EGLN1_HUMAN | Hypoxia-inducible factor prolyl hydroxylase 2 (HIFPH2)
Type:
Mol. Mass.:
27759.84
Organism:
Homo sapiens (Human)
Description:
EGLN-1-179/426
Residue:
248
  
Inhibitor
Name:
BDBM107699
Synonyms:
US11426393, Compound Table XV.5 US8722895, 5: [(3-Hydroxy-4'-methyl-biphenyl-4- carbonyl)-amino]-acetic acid USRE47437, Example [(3-Hydroxy-4'-methyl-biphenyl-4-carbonyl)-amino]-acetic acid
Type:
Small organic molecule
Emp. Form.:
C16H15NO4
Mol. Mass.:
285.2946
SMILES:
Cc1ccc(cc1)-c1ccc(C(=O)NCC(O)=O)c(O)c1
: