Target
Egl nine homolog 1 [179-426]
Ligand
BDBM301799
Substrate
Meas. Tech.
EGLN-1 Activity Assay
IC50
99000±n/a nM
Citation
 Kawamoto, RMWu, SEvdokimov, AGGreis, KDBoyer, ASWarshakoon, NC Prolyl hydroxylase inhibitors and methods of use US Patent  US11426393 Publication Date 8/30/2022 
Target
Name:
Egl nine homolog 1 [179-426]
Synonyms:
C1orf12 EGLN1_HUMAN | Hypoxia-inducible factor prolyl hydroxylase 2 (HIFPH2)
Type:
Mol. Mass.:
27759.84
Organism:
Homo sapiens (Human)
Description:
EGLN-1-179/426
Residue:
248
  
Inhibitor
Name:
BDBM301799
Synonyms:
US11426393, Compound Table XV.8 USRE47437, Example {[5-(4-Cyanophenyl)-3-hydroxypyridine-2-carbonyl]amino}-acetic acid
Type:
Small organic molecule
Emp. Form.:
C15H11N3O4
Mol. Mass.:
297.2655
SMILES:
OC(=O)CNC(=O)c1ncc(cc1O)-c1ccc(cc1)C#N
: