Target
Trans-2-enoyl-ACP reductase II
Ligand
BDBM8726
Substrate
Crotonoyl-ACP
Meas. Tech.
Enzyme Inhibition Assay
Temperature
303.15±n/a K
IC50
>30000±n/a nM
Comments
extracted
Citation
 Seefeld, MAMiller, WHNewlander, KABurgess, WJDeWolf, WEElkins, PAHead, MSJakas, DRJanson, CAKeller, PMManley, PJMoore, TDPayne, DJPearson, SPolizzi, BJQiu, XRittenhouse, SFUzinskas, INWallis, NGHuffman, WF Indole naphthyridinones as inhibitors of bacterial enoyl-ACP reductases FabI and FabK. J Med Chem 46:1627-35 (2003)  
Target
Name:
Trans-2-enoyl-ACP reductase II
Synonyms:
Enoyl-ACP Reductase (FabK) NADH-dependent, FAD-containing enoyl-ACP | trans-2-enoyl-ACP reductase II
Type:
Enzyme
Mol. Mass.:
34170.89
Organism:
Streptococcus pneumoniae
Description:
Residue:
324
  
Inhibitor
Name:
BDBM8726
Synonyms:
5-chloro-2-(2,4-dichlorophenoxy)phenol TCL US20230414581, Compound 35
Type:
Small organic molecule
Emp. Form.:
C12H7Cl3O2
Mol. Mass.:
289.542
SMILES:
Oc1cc(Cl)ccc1Oc1ccc(Cl)cc1Cl
:
Substrate
Name:
Crotonoyl-ACP
Synonyms:
Type:
Other Protein Type
Mol. Mass.:
358.43
Organism:
Description:
1. NAD(P)H is its co-substrate. 2. Crotonoyl-ACP was synthesized using ACP synthase to catalyse the addition of a crotonoyl group from crotonoyl-CoA to apo-ACP
Residue:
3
NA