Target
P2X purinoceptor 7
Ligand
BDBM510052
Substrate
Meas. Tech.
Human P2X7 Functional Assay
IC50
<50±n/a nM
Citation
 Arano, YToyoshima, KSone, TMatsubara, K Tetrahydroquinoline derivatives as P2X7 receptor antagonists US Patent  US11439633 Publication Date 9/13/2022 
Target
Name:
P2X purinoceptor 7
Synonyms:
ATP receptor P2RX7_HUMAN P2X purinoceptor 7 (P2X7) P2Z receptor | Purinergic receptor
Type:
Protein
Mol. Mass.:
68602.85
Organism:
Homo sapiens (Human)
Description:
Q99572
Residue:
595
  
Inhibitor
Name:
BDBM510052
Synonyms:
N-(2-chloro-3-(trifluoro methyl)benzyl)-8-oxo-5, 6,7,8-tetrahydroquinoline- 5-carboxamide US11439633, Example 2
Type:
Small organic molecule
Emp. Form.:
C18H14ClF3N2O2
Mol. Mass.:
382.764
SMILES:
FC(F)(F)c1cccc(CNC(=O)C2CCC(=O)c3ncccc23)c1Cl
: