Target
P2X purinoceptor 7
Ligand
BDBM510148
Substrate
Meas. Tech.
Human P2X7 Functional Assay
IC50
<50±n/a nM
Citation
 Arano, YToyoshima, KSone, TMatsubara, K Tetrahydroquinoline derivatives as P2X7 receptor antagonists US Patent  US11439633 Publication Date 9/13/2022 
Target
Name:
P2X purinoceptor 7
Synonyms:
ATP receptor P2RX7_HUMAN P2X purinoceptor 7 (P2X7) P2Z receptor | Purinergic receptor
Type:
Protein
Mol. Mass.:
68602.85
Organism:
Homo sapiens (Human)
Description:
Q99572
Residue:
595
  
Inhibitor
Name:
BDBM510148
Synonyms:
N-(2,3-dichlorobenzyl)- 8-hydroxy-5,6,7,8-tetra hydroquinoline-5- carboxamide US11439633, Example 8
Type:
Small organic molecule
Emp. Form.:
C17H16Cl2N2O2
Mol. Mass.:
351.227
SMILES:
OC1CCC(C(=O)NCc2cccc(Cl)c2Cl)c2cccnc12
: