Target
P2X purinoceptor 7
Ligand
BDBM510150
Substrate
Meas. Tech.
Human P2X7 Functional Assay
IC50
<50±n/a nM
Citation
 Arano, YToyoshima, KSone, TMatsubara, K Tetrahydroquinoline derivatives as P2X7 receptor antagonists US Patent  US11439633 Publication Date 9/13/2022 
Target
Name:
P2X purinoceptor 7
Synonyms:
ATP receptor P2RX7_HUMAN P2X purinoceptor 7 (P2X7) P2Z receptor | Purinergic receptor
Type:
Protein
Mol. Mass.:
68602.85
Organism:
Homo sapiens (Human)
Description:
Q99572
Residue:
595
  
Inhibitor
Name:
BDBM510150
Synonyms:
N-(2,4-dichloro-6-(methoxy- methyl)benzyl)-8-hydroxy- 5,6,7,8-tetrahydro- quinoline-5-carboxamide US11439633, Example 10
Type:
Small organic molecule
Emp. Form.:
C19H20Cl2N2O3
Mol. Mass.:
395.28
SMILES:
COCc1cc(Cl)cc(Cl)c1CNC(=O)C1CCC(O)c2ncccc12
: