Target
Metabotropic glutamate receptor 5
Ligand
BDBM571419
Substrate
Meas. Tech.
Radioligand Binding Assay at Cloned Human mGluR5 Receptor Subtype
Ki
82.9±n/a nM
Citation
 Riva, CGraziani, DLonghi, MCallegari, EFrigerio, FAngelico, P Heterocyclylmethylidene derivatives and their use as modulators of mGluR5 receptors US Patent  US11440922 Publication Date 9/13/2022 
Target
Name:
Metabotropic glutamate receptor 5
Synonyms:
GPRC1E GRM5_HUMAN metabotropic glutamate 5 | metabotropic glutamate 5a
Type:
Enzyme
Mol. Mass.:
132484.72
Organism:
Homo sapiens (Human)
Description:
Residue:
1212
  
Inhibitor
Name:
BDBM571419
Synonyms:
US11440922, Example 64 | methyl (3E)-2,2-dimethyl- 3-[3-(4-methylpyrimidin- 2-yl)prop-2-yn-1- ylidene]pyrrolidine-1- carboxylate
Type:
Small organic molecule
Emp. Form.:
C16H19N3O2
Mol. Mass.:
285.341
SMILES:
COC(=O)N1CC\C(=C/C#Cc2nccc(C)n2)C1(C)C
: