Target
Metabotropic glutamate receptor 5
Ligand
BDBM571420
Substrate
Meas. Tech.
Radioligand Binding Assay at Cloned Human mGluR5 Receptor Subtype
Ki
29.8±n/a nM
Citation
 Riva, CGraziani, DLonghi, MCallegari, EFrigerio, FAngelico, P Heterocyclylmethylidene derivatives and their use as modulators of mGluR5 receptors US Patent  US11440922 Publication Date 9/13/2022 
Target
Name:
Metabotropic glutamate receptor 5
Synonyms:
GPRC1E GRM5_HUMAN metabotropic glutamate 5 | metabotropic glutamate 5a
Type:
Enzyme
Mol. Mass.:
132484.72
Organism:
Homo sapiens (Human)
Description:
Residue:
1212
  
Inhibitor
Name:
BDBM571420
Synonyms:
US11440922, Example 73 | ethyl (3E)-3-[3-(4- cyanopyridin-2-yl)prop-2- yn-1-ylidene]-2,2- dimethylpyrrolidine-1- carboxylate
Type:
Small organic molecule
Emp. Form.:
C18H19N3O2
Mol. Mass.:
309.3624
SMILES:
CCOC(=O)N1CC\C(=C/C#Cc2cc(ccn2)C#N)C1(C)C
: