Target
Metabotropic glutamate receptor 5
Ligand
BDBM571423
Substrate
Meas. Tech.
Radioligand Binding Assay at Cloned Human mGluR5 Receptor Subtype
Ki
932±n/a nM
Citation
 Riva, CGraziani, DLonghi, MCallegari, EFrigerio, FAngelico, P Heterocyclylmethylidene derivatives and their use as modulators of mGluR5 receptors US Patent  US11440922 Publication Date 9/13/2022 
Target
Name:
Metabotropic glutamate receptor 5
Synonyms:
GPRC1E GRM5_HUMAN metabotropic glutamate 5 | metabotropic glutamate 5a
Type:
Enzyme
Mol. Mass.:
132484.72
Organism:
Homo sapiens (Human)
Description:
Residue:
1212
  
Inhibitor
Name:
BDBM571423
Synonyms:
(3-chlorophenyl)[(4E)-4- {[5-(3-chlorophenyl)-1H- pyrazol-3-yl]methylidene}- 3,3-dimethylpiperidin-1- yl]methanone | US11440922, Example 107
Type:
Small organic molecule
Emp. Form.:
C24H23Cl2N3O
Mol. Mass.:
440.365
SMILES:
CC1(C)CN(CC\C1=C/c1cc([nH]n1)-c1cccc(Cl)c1)C(=O)c1cccc(Cl)c1
: