Target
Metabotropic glutamate receptor 5
Ligand
BDBM571429
Substrate
Meas. Tech.
Radioligand Binding Assay at Cloned Human mGluR5 Receptor Subtype
Ki
2.24±n/a nM
Citation
 Riva, CGraziani, DLonghi, MCallegari, EFrigerio, FAngelico, P Heterocyclylmethylidene derivatives and their use as modulators of mGluR5 receptors US Patent  US11440922 Publication Date 9/13/2022 
Target
Name:
Metabotropic glutamate receptor 5
Synonyms:
GPRC1E GRM5_HUMAN metabotropic glutamate 5 | metabotropic glutamate 5a
Type:
Enzyme
Mol. Mass.:
132484.72
Organism:
Homo sapiens (Human)
Description:
Residue:
1212
  
Inhibitor
Name:
BDBM571429
Synonyms:
US11440922, Example 166 | {(4E)-4-[3-(3- chlorophenyl)prop-2-yn-1- ylidene]-3,3- dimethylpiperidin-1- yl}(4,6- dimethoxypyrimidin-2- yl)methanone
Type:
Small organic molecule
Emp. Form.:
C23H24ClN3O3
Mol. Mass.:
425.908
SMILES:
COc1cc(OC)nc(n1)C(=O)N1CC\C(=C/C#Cc2cccc(Cl)c2)C(C)(C)C1
: