Target
Metabotropic glutamate receptor 5
Ligand
BDBM571432
Substrate
Meas. Tech.
Radioligand Binding Assay at Cloned Human mGluR5 Receptor Subtype
Ki
637±n/a nM
Citation
 Riva, CGraziani, DLonghi, MCallegari, EFrigerio, FAngelico, P Heterocyclylmethylidene derivatives and their use as modulators of mGluR5 receptors US Patent  US11440922 Publication Date 9/13/2022 
Target
Name:
Metabotropic glutamate receptor 5
Synonyms:
GPRC1E GRM5_HUMAN metabotropic glutamate 5 | metabotropic glutamate 5a
Type:
Enzyme
Mol. Mass.:
132484.72
Organism:
Homo sapiens (Human)
Description:
Residue:
1212
  
Inhibitor
Name:
BDBM571432
Synonyms:
3-[(3E)-3-{1-[(2,5- dimethylfuran-3- yl)carbonyl]-3,3- dimethylpiperidin-4- ylidene}prop-1-yn-1-yl]-5- fluorobenzonitrile | US11440922, Example 200
Type:
Small organic molecule
Emp. Form.:
C24H23FN2O2
Mol. Mass.:
390.45
SMILES:
Cc1cc(C(=O)N2CC\C(=C/C#Cc3cc(F)cc(c3)C#N)C(C)(C)C2)c(C)o1
: