Target
5-hydroxytryptamine receptor 1A
Ligand
BDBM458540
Substrate
Meas. Tech.
Binding Affinity Assay
Ki
0.150±n/a nM
Citation
 Yoshinaga, HIkuma, YIkeda, JAdachi, SMitsunuma, HAihara, YBesnard, JBell, AS Substituted lactams showing serotonin 5-HT receptor activity US Patent  US11466007 Publication Date 10/11/2022 
Target
Name:
5-hydroxytryptamine receptor 1A
Synonyms:
5-HT-1A 5-hydroxytryptamine receptor 1A (5-HT-1A) ADRB2RL1 Dopamine D2 receptor and serotonin 1a receptor HTR1A | Serotonin receptor 1A
Type:
Mol. Mass.:
46122.49
Organism:
Homo sapiens (Human)
Description:
Residue:
422
  
Inhibitor
Name:
BDBM458540
Synonyms:
US10745401, Example 14 | US11466007, Example 20
Type:
Small organic molecule
Emp. Form.:
C23H26N4O3
Mol. Mass.:
406.4775
SMILES:
COc1cc2CCN(CCN3CCC(CC3)c3noc4ccccc34)C(=O)c2cn1
: